Target
Neurotensin receptor type 2
Ligand
BDBM50553779
Substrate
Meas. Tech.
ChEMBL_2047160 (CHEMBL4701859)
Ki
0.110000±n/a nM
Citation
 Gonzalez, SDumitrascuta, MEiselt, ELouis, SKunze, LBlasiol, AVivancos, MPreviti, SDewolf, EMartin, CTourwé, DCavelier, FGendron, LSarret, PSpetea, MBallet, S Optimized Opioid-Neurotensin Multitarget Peptides: From Design to Structure-Activity Relationship Studies. J Med Chem 63:12929-12941 (2020)  
Target
Name:
Neurotensin receptor type 2
Synonyms:
Levocabastine-sensitive neurotensin receptor NTR2 NTR2_HUMAN Neurotensin receptor Neurotensin receptor type 2
Type:
PROTEIN
Mol. Mass.:
45404.76
Organism:
Homo sapiens (Human)
Description:
ChEMBL_1281495
Residue:
410
  
Inhibitor
Name:
BDBM50553779
Synonyms:
CHEMBL4742999
Type:
Small organic molecule
Emp. Form.:
C41H70N12O8
Mol. Mass.:
859.0701
SMILES:
CC(C)C[C@H](NC(=O)[C@@H](NC(=O)[C@H](Cc1c(C)cc(O)cc1C)NC(=O)[C@@H]1CCCN1C(=O)[C@H](CCCNC(N)=N)NC(=O)C[C@@H](N)CCCNC(N)=N)C(C)(C)C)C(O)=O
: