Target
Macrophage migration inhibitory factor
Ligand
BDBM50553883
Substrate
Meas. Tech.
ChEMBL_2047522 (CHEMBL4702221)
Kd
470±n/a nM
Citation
 Xiao, ZChen, DSong, Svan der Vlag, Rvan der Wouden, PEvan Merkerk, RCool, RHHirsch, AKHMelgert, BNQuax, WJPoelarends, GJDekker, FJ 7-Hydroxycoumarins Are Affinity-Based Fluorescent Probes for Competitive Binding Studies of Macrophage Migration Inhibitory Factor. J Med Chem 63:11920-11933 (2020)  
Target
Name:
Macrophage migration inhibitory factor
Synonyms:
GIF Glycosylation-inhibiting factor L-dopachrome tautomerase MIF/CD74 (Macrophage migration inhibitory factor and HLA-DR antigens-associated invariant chain) MMIF Macrophage migration inhibitory factor (MIF) | Phenylpyruvate tautomerase
Type:
Enzyme
Mol. Mass.:
12478.18
Organism:
Homo sapiens (Human)
Description:
P14174
Residue:
115
  
Inhibitor
Name:
BDBM50553883
Synonyms:
CHEMBL4791357
Type:
Small organic molecule
Emp. Form.:
C17H12N4O
Mol. Mass.:
288.3034
SMILES:
Oc1ccc(cc1)-n1cc(nn1)-c1cc2ccccc2cn1
: