Target
Macrophage migration inhibitory factor
Ligand
BDBM50553886
Substrate
Meas. Tech.
ChEMBL_2047522 (CHEMBL4702221)
Kd
1400±n/a nM
Citation
 Xiao, ZChen, DSong, Svan der Vlag, Rvan der Wouden, PEvan Merkerk, RCool, RHHirsch, AKHMelgert, BNQuax, WJPoelarends, GJDekker, FJ 7-Hydroxycoumarins Are Affinity-Based Fluorescent Probes for Competitive Binding Studies of Macrophage Migration Inhibitory Factor. J Med Chem 63:11920-11933 (2020)  
Target
Name:
Macrophage migration inhibitory factor
Synonyms:
GIF Glycosylation-inhibiting factor L-dopachrome tautomerase MIF/CD74 (Macrophage migration inhibitory factor and HLA-DR antigens-associated invariant chain) MMIF Macrophage migration inhibitory factor (MIF) | Phenylpyruvate tautomerase
Type:
Enzyme
Mol. Mass.:
12478.18
Organism:
Homo sapiens (Human)
Description:
P14174
Residue:
115
  
Inhibitor
Name:
BDBM50553886
Synonyms:
CHEMBL4741927
Type:
Small organic molecule
Emp. Form.:
C18H13ClFN5O2
Mol. Mass.:
385.78
SMILES:
Oc1ccc(cc1F)-n1cc(CNC(=O)c2cc3cc(Cl)ccc3[nH]2)nn1
: