Target
Kallikrein-1
Ligand
BDBM50114449
Substrate
Meas. Tech.
ChEBML_92367
IC50
>11000±n/a nM
Citation
 Jia, ZJWu, YHuang, WGoldman, EZhang, PWoolfrey, JWong, PHuang, BSinha, UPark, GReed, AScarborough, RMZhu, BY Design, synthesis and biological activity of novel non-amidine factor Xa inhibitors. Part 1: P(1) structure-activity relationships of the substituted 1-(2-Naphthyl)-1H-pyrazole-5-carboxylamides. Bioorg Med Chem Lett 12:1651-5 (2002)  
Target
Name:
Kallikrein-1
Synonyms:
KLK1 Kallikrein 1 Kidney/pancreas/salivary gland kallikrein | Tissue kallikrein
Type:
Enzyme
Mol. Mass.:
28874.69
Organism:
Homo sapiens (Human)
Description:
P06870
Residue:
262
  
Inhibitor
Name:
BDBM50114449
Synonyms:
3-[3-Methyl-5-(2'-sulfamoyl-biphenyl-4-ylcarbamoyl)-pyrazol-1-yl]-naphthalene-2-carboxylic acid methyl ester | CHEMBL298259
Type:
Small organic molecule
Emp. Form.:
C29H24N4O5S
Mol. Mass.:
540.59
SMILES:
COC(=O)c1cc2ccccc2cc1-n1nc(C)cc1C(=O)Nc1ccc(cc1)-c1ccccc1S(N)(=O)=O
: