Target
Serine protease 1
Ligand
BDBM50114449
Substrate
Meas. Tech.
ChEMBL_212715 (CHEMBL818174)
IC50
>11000±n/a nM
Citation
 Jia, ZJWu, YHuang, WGoldman, EZhang, PWoolfrey, JWong, PHuang, BSinha, UPark, GReed, AScarborough, RMZhu, BY Design, synthesis and biological activity of novel non-amidine factor Xa inhibitors. Part 1: P(1) structure-activity relationships of the substituted 1-(2-Naphthyl)-1H-pyrazole-5-carboxylamides. Bioorg Med Chem Lett 12:1651-5 (2002)  
Target
Name:
Serine protease 1
Synonyms:
Alpha-trypsin chain 1 Beta-trypsin PRSS1 TRP1 TRY1_HUMAN Thrombin & trypsin Trypsin I | Trypsin-1
Type:
Enzyme
Mol. Mass.:
26557.80
Organism:
Homo sapiens (Human)
Description:
P07477
Residue:
247
  
Inhibitor
Name:
BDBM50114449
Synonyms:
3-[3-Methyl-5-(2'-sulfamoyl-biphenyl-4-ylcarbamoyl)-pyrazol-1-yl]-naphthalene-2-carboxylic acid methyl ester | CHEMBL298259
Type:
Small organic molecule
Emp. Form.:
C29H24N4O5S
Mol. Mass.:
540.59
SMILES:
COC(=O)c1cc2ccccc2cc1-n1nc(C)cc1C(=O)Nc1ccc(cc1)-c1ccccc1S(N)(=O)=O
: