Target
Beta-lactamase
Ligand
BDBM50114505
Substrate
Meas. Tech.
ChEBML_47852
IC50
3±n/a nM
Citation
 Buynak, JDVogeti, LDoppalapudi, VRSolomon, GMChen, H Cephalosporin-derived inhibitors of beta-lactamase. Part 4: The C3 substituent. Bioorg Med Chem Lett 12:1663-6 (2002)  
Target
Name:
Beta-lactamase
Synonyms:
AMPC_ENTCL | ampC
Type:
PROTEIN
Mol. Mass.:
41306.67
Organism:
Enterobacter cloacae
Description:
ChEMBL_40258
Residue:
381
  
Inhibitor
Name:
BDBM50114505
Synonyms:
CHEMBL295625 | Sodium; (R)-3-chloro-5,5,8-trioxo-7-[1-pyridin-2-yl-meth-(Z)-ylidene]-5lambda*6*-thia-1-aza-bicyclo[4.2.0]oct-2-ene-2-carboxylate
Type:
Small organic molecule
Emp. Form.:
C13H8ClN2O5S
Mol. Mass.:
339.732
SMILES:
[O-]C(=O)C1=C(Cl)CS(=O)(=O)[C@H]2N1C(=O)\C2=C\c1ccccn1
: