Target
Beta-lactamase
Ligand
BDBM50114514
Substrate
Meas. Tech.
ChEBML_206310
IC50
8.3±n/a nM
Citation
 Buynak, JDVogeti, LDoppalapudi, VRSolomon, GMChen, H Cephalosporin-derived inhibitors of beta-lactamase. Part 4: The C3 substituent. Bioorg Med Chem Lett 12:1663-6 (2002)  
Target
Name:
Beta-lactamase
Synonyms:
AMPC_ECOLI Beta-lactamase (AmpC) Cephalosporinase ampA | ampC
Type:
Protien
Mol. Mass.:
41561.62
Organism:
Escherichia coli
Description:
P00811
Residue:
377
  
Inhibitor
Name:
BDBM50114514
Synonyms:
CHEMBL44932 | Sodium; (R)-3-[(E)-2-(2-guanidino-ethylcarbamoyl)-vinyl]-5,5,8-trioxo-7-[1-pyridin-2-yl-meth-(Z)-ylidene]-5lambda*6*-thia-1-aza-bicyclo[4.2.0]oct-2-ene-2-carboxylate
Type:
Small organic molecule
Emp. Form.:
C19H19N6O6S
Mol. Mass.:
459.456
SMILES:
NC(=N)NCCNC(=O)C=CC1=C(N2[C@@H](C(=Cc3ccccn3)C2=O)S(=O)(=O)C1)C([O-])=O
: