Target
Prothrombin
Ligand
BDBM50085393
Substrate
Meas. Tech.
ChEBML_48311
Ki
>4000±n/a nM
Citation
 Czekaj, MKlein, SIGuertin, KRGardner, CJZulli, ALPauls, HWSpada, APCheney, DLBrown, KDColussi, DJChu, VLeadley, RJDunwiddie, CT Optimization of the beta-aminoester class of factor Xa inhibitors. Part 1: P(4) and side-chain modifications for improved in vitro potency. Bioorg Med Chem Lett 12:1667-70 (2002)  
Target
Name:
Prothrombin
Synonyms:
Activation peptide fragment 1 Coagulation factor II Prothrombin precursor Thrombin heavy chain | Thrombin light chain
Type:
Protein
Mol. Mass.:
70029.57
Organism:
Homo sapiens (Human)
Description:
P00734
Residue:
622
  
Inhibitor
Name:
BDBM50085393
Synonyms:
(2R,3R)-2-(3-Carbamimidoyl-benzyl)-3-[(3'-carbamoyl-biphenyl-4-carbonyl)-amino]-butyric acid methyl ester | CHEMBL44050
Type:
Small organic molecule
Emp. Form.:
C27H28N4O4
Mol. Mass.:
472.5356
SMILES:
COC(=O)[C@H](Cc1cccc(c1)C(N)=N)[C@@H](C)NC(=O)c1ccc(cc1)-c1cccc(c1)C(N)=O
: