Target
Serine protease 1
Ligand
BDBM50085393
Substrate
Meas. Tech.
ChEBML_212853
Ki
90±n/a nM
Citation
 Czekaj, MKlein, SIGuertin, KRGardner, CJZulli, ALPauls, HWSpada, APCheney, DLBrown, KDColussi, DJChu, VLeadley, RJDunwiddie, CT Optimization of the beta-aminoester class of factor Xa inhibitors. Part 1: P(4) and side-chain modifications for improved in vitro potency. Bioorg Med Chem Lett 12:1667-70 (2002)  
Target
Name:
Serine protease 1
Synonyms:
Alpha-trypsin chain 1 Beta-trypsin PRSS1 TRP1 TRY1_HUMAN Thrombin & trypsin Trypsin I | Trypsin-1
Type:
Enzyme
Mol. Mass.:
26557.80
Organism:
Homo sapiens (Human)
Description:
P07477
Residue:
247
  
Inhibitor
Name:
BDBM50085393
Synonyms:
(2R,3R)-2-(3-Carbamimidoyl-benzyl)-3-[(3'-carbamoyl-biphenyl-4-carbonyl)-amino]-butyric acid methyl ester | CHEMBL44050
Type:
Small organic molecule
Emp. Form.:
C27H28N4O4
Mol. Mass.:
472.5356
SMILES:
COC(=O)[C@H](Cc1cccc(c1)C(N)=N)[C@@H](C)NC(=O)c1ccc(cc1)-c1cccc(c1)C(N)=O
: