Target
Beta-adrenergic receptor kinase 1
Ligand
BDBM50554268
Substrate
Meas. Tech.
ChEMBL_2048915 (CHEMBL4703614)
IC50
<10.0±n/a nM
Citation
 Xu, GGaul, MDLiu, ZDesJarlais, RLQi, JWang, WKrosky, DPetrounia, IMilligan, CMHermans, ALu, HRHuang, DZXu, JZSpurlino, JC Hit-to-lead optimization and discovery of a potent, and orally bioavailable G protein coupled receptor kinase 2 (GRK2) inhibitor. Bioorg Med Chem Lett 30:0 (2020)  
Target
Name:
Beta-adrenergic receptor kinase 1
Synonyms:
ADRBK1 BARK Beta-ARK-1 G-protein coupled receptor kinase 2 GRK2
Type:
Enzyme
Mol. Mass.:
79581.30
Organism:
Homo sapiens (Human)
Description:
P25098
Residue:
689
  
Inhibitor
Name:
BDBM50554268
Synonyms:
CHEMBL4745381
Type:
Small organic molecule
Emp. Form.:
C26H19F2N5O2
Mol. Mass.:
471.4582
SMILES:
Fc1cccc(F)c1CNC(=O)c1cccc(Cn2cnc3ccc(cc3c2=O)-c2cn[nH]c2)c1
: