Target
Cruzipain
Ligand
BDBM50451625
Substrate
Meas. Tech.
ChEMBL_2048968 (CHEMBL4703667)
Ki
1.6±n/a nM
Citation
 Ribeiro, JFRCianni, LLi, CWarwick, TGde Vita, DRosini, FDos Reis Rocho, FMartins, FCPKenny, PWLameira, JLeitão, AEmsley, JMontanari, CA Crystal structure of Leishmania mexicana cysteine protease B in complex with a high-affinity azadipeptide nitrile inhibitor. Bioorg Med Chem 28:0 (2020)  
Target
Name:
Cruzipain
Synonyms:
CYSP_TRYCR Cruzaine | Major cysteine proteinase
Type:
Protein
Mol. Mass.:
49831.41
Organism:
Trypanosoma cruzi
Description:
P25779
Residue:
467
  
Inhibitor
Name:
BDBM50451625
Synonyms:
CHEMBL4217414
Type:
Small organic molecule
Emp. Form.:
C18H30N6O2
Mol. Mass.:
362.4698
SMILES:
CC(C)C[C@H](NC(=O)c1cc(nn1C)C(C)(C)C)C(=O)N(C)N(C)C#N
: