Target
Acidic mammalian chitinase
Ligand
BDBM50554342
Substrate
Meas. Tech.
ChEMBL_2049318 (CHEMBL4704017)
IC50
54±n/a nM
Target
Name:
Acidic mammalian chitinase
Synonyms:
AMCase CHIA Lung-specific protein TSA1902
Type:
Protein
Mol. Mass.:
52266.66
Organism:
Homo sapiens (Human)
Description:
Q9BZP6
Residue:
476
  
Inhibitor
Name:
BDBM50554342
Synonyms:
CHEMBL4776610
Type:
Small organic molecule
Emp. Form.:
C20H29ClN6O
Mol. Mass.:
404.937
SMILES:
CC[C@H]1CN([C@@H](Cc2ccc(Cl)cc2)CO1)C1CCN(CC1)c1nc(N)n[nH]1
: