Target
Acidic mammalian chitinase
Ligand
BDBM50554348
Substrate
Meas. Tech.
ChEMBL_2049318 (CHEMBL4704017)
IC50
24±n/a nM
Target
Name:
Acidic mammalian chitinase
Synonyms:
AMCase CHIA Lung-specific protein TSA1902
Type:
Protein
Mol. Mass.:
52266.66
Organism:
Homo sapiens (Human)
Description:
Q9BZP6
Residue:
476
  
Inhibitor
Name:
BDBM50554348
Synonyms:
CHEMBL4749391
Type:
Small organic molecule
Emp. Form.:
C20H28ClN7O2
Mol. Mass.:
433.935
SMILES:
CNC(=O)[C@H]1CN([C@@H](Cc2ccc(Cl)cc2)CO1)C1CCN(CC1)c1nc(N)n[nH]1
: