Target
Mitogen-activated protein kinase 8
Ligand
BDBM50115298
Substrate
Meas. Tech.
ChEMBL_216679 (CHEMBL820292)
IC50
>30000±n/a nM
Citation
 Matsuno, KIchimura, MNakajima, TTahara, KFujiwara, SKase, HUshiki, JGiese, NAPandey, AScarborough, RMLokker, NAYu, JCIrie, JTsukuda, EIde, SOda, SNomoto, Y Potent and selective inhibitors of platelet-derived growth factor receptor phosphorylation. 1. Synthesis, structure-activity relationship, and biological effects of a new class of quinazoline derivatives. J Med Chem 45:3057-66 (2002)  
Target
Name:
Mitogen-activated protein kinase 8
Synonyms:
JNK-46 JNK1-alpha-1 MK08_HUMAN PRKM8 SAPK1C c-Jun N-terminal kinase 1 c-Jun N-terminal kinase 1(JNK1) | c-Jun N-terminal kinase 2 (JNK2)
Type:
Enzyme
Mol. Mass.:
48297.57
Organism:
Homo sapiens (Human)
Description:
JNK-1 was purchased from Upstate Cell Signaling Solutions (formerly Upstate Biotechnology).
Residue:
427
  
Inhibitor
Name:
BDBM50115298
Synonyms:
4-(6,7-Dimethoxy-quinazolin-4-yl)-piperazine-1-carboxylic acid (4-bromo-phenyl)-amide | CHEMBL323336
Type:
Small organic molecule
Emp. Form.:
C21H22BrN5O3
Mol. Mass.:
472.335
SMILES:
COc1cc2ncnc(N3CCN(CC3)C(=O)Nc3ccc(Br)cc3)c2cc1OC
: