Target
Leukocyte tyrosine kinase receptor
Ligand
BDBM50554817
Substrate
Meas. Tech.
ChEMBL_2050830 (CHEMBL4705529)
IC50
6.3±n/a nM
Citation
 Chen, JZhou, YDong, XLiu, LBai, LMcEachern, DPrzybranowski, SYang, CYStuckey, JLi, XWen, BZhao, TSun, SSun, DJiao, LJing, YGuo, MYang, DWang, S Discovery of CJ-2360 as a Potent and Orally Active Inhibitor of Anaplastic Lymphoma Kinase Capable of Achieving Complete Tumor Regression. J Med Chem 63:13994-14016 (2020)  
Target
Name:
Leukocyte tyrosine kinase receptor
Synonyms:
LTK TYK1
Type:
PROTEIN
Mol. Mass.:
91679.76
Organism:
Homo sapiens (Human)
Description:
ChEMBL_586334
Residue:
864
  
Inhibitor
Name:
BDBM50554817
Synonyms:
CHEMBL4764610
Type:
Small organic molecule
Emp. Form.:
C27H30FN5O2
Mol. Mass.:
475.5578
SMILES:
COc1cc2c(c(F)c1N1C[C@H](C)N(C)[C@H](C)C1)n(C(C)C)c1[nH]c3cc(ccc3c1c2=O)C#N
: