Target
Tyrosine-protein phosphatase non-receptor type 1
Ligand
BDBM50115761
Substrate
Meas. Tech.
ChEBML_162256
IC50
1010±n/a nM
Citation
 Ahn, JHCho, SYHa, JDChu, SYJung, SHJung, YSBaek, JYChoi, IKShin, EYKang, SKKim, SSCheon, HGYang, SDChoi, JK Synthesis and PTP1B inhibition of 1,2-naphthoquinone derivatives as potent anti-diabetic agents. Bioorg Med Chem Lett 12:1941-6 (2002)  
Target
Name:
Tyrosine-protein phosphatase non-receptor type 1
Synonyms:
PTN1_HUMAN PTPN1 Protein tyrosine phosphatase-1B (PTP1B) Protein-tyrosine phosphatase 1B (PTP1B) Tyrosine-protein phosphatase non-receptor type 1 (PTP1B)
Type:
Protein phosphatase
Mol. Mass.:
49963.76
Organism:
Homo sapiens (Human)
Description:
Human recombinant GST-fusion PTP1B (1-435).
Residue:
435
  
Inhibitor
Name:
BDBM50115761
Synonyms:
4-[2-(3,4-Dioxo-1-phenyl-3,4-dihydro-naphthalen-2-yl)-ethyl]-benzoic acid ethyl ester | CHEMBL292444
Type:
Small organic molecule
Emp. Form.:
C27H22O4
Mol. Mass.:
410.4612
SMILES:
CCOC(=O)c1ccc(CCC2=C(c3ccccc3)c3ccccc3C(=O)C2=O)cc1
: