Target
Neuropeptide FF receptor 2
Ligand
BDBM50555156
Substrate
Meas. Tech.
ChEMBL_2051456 (CHEMBL4706155)
EC50
191±n/a nM
Citation
 Zhang, MXu, BLi, NLiu, HShi, XZhang, QShi, YXu, KXiao, JChen, DZhu, HSun, YZhang, TZhang, RFang, Q Synthesis and Biological Characterization of Cyclic Disulfide-Containing Peptide Analogs of the Multifunctional Opioid/Neuropeptide FF Receptor Agonists That Produce Long-Lasting and Nontolerant Antinociception. J Med Chem 63:15709-15725 (2020)  
Target
Name:
Neuropeptide FF receptor 2
Synonyms:
G-protein coupled receptor 74 GPR74 NPFF2_HUMAN NPGPR Neuropeptide G-protein coupled receptor
Type:
Enzyme Catalytic Domain
Mol. Mass.:
60293.78
Organism:
Homo sapiens (Human)
Description:
NPFF2 0 HUMAN::Q9Y5X5
Residue:
522
  
Inhibitor
Name:
BDBM50555156
Synonyms:
CHEMBL4750006
Type:
Small organic molecule
Emp. Form.:
C51H68N14O11S2
Mol. Mass.:
1117.303
SMILES:
N[C@@H](Cc1ccc(O)cc1)C(=O)N[C@@H]1CSSC[C@@H](NC(=O)[C@H](Cc2ccccc2)NC(=O)CNC1=O)C(=O)N1CCC[C@H]1C(=O)N[C@@H](CCC(N)=O)C(=O)N[C@@H](CCCNC(N)=N)C(=O)N[C@@H](Cc1ccccc1)C(N)=O
: