Target
Cathepsin D
Ligand
BDBM50555173
Substrate
Meas. Tech.
ChEMBL_2051503 (CHEMBL4706202)
IC50
4.0±n/a nM
Citation
 Goyal, SPatel, KVNagare, YRaykar, DBRaikar, SSDolas, AKhurana, PCyriac, RSarak, SGangar, MAgarwal, AKKulkarni, A Identification and structure-activity relationship studies of small molecule inhibitors of the human cathepsin D. Bioorg Med Chem 29:0 (2021)  
Target
Name:
Cathepsin D
Synonyms:
CATD_HUMAN CTSD Cathepsin D heavy chain Cathepsin D precursor
Type:
Enzyme
Mol. Mass.:
44551.72
Organism:
Homo sapiens (Human)
Description:
Human proCathepsin D (SwissProt accession number P07339) was expressed in Sf9 cells, purified, and autoactivated.
Residue:
412
  
Inhibitor
Name:
BDBM50555173
Synonyms:
CHEMBL4754691
Type:
Small organic molecule
Emp. Form.:
C30H40F3N5O8S
Mol. Mass.:
687.728
SMILES:
OC(=O)C(F)(F)F.CNS(=O)(=O)c1ccc(C)c(NC(=O)[C@@H](CC2CCCCC2)NC(=N)NC(=O)Cc2ccc(OC)c(OC)c2)c1
: