Target
Coagulation factor X
Ligand
BDBM50115861
Substrate
Meas. Tech.
ChEBML_49126
Ki
1500±n/a nM
Citation
 Mackman, RLHui, HCBreitenbucher, JGKatz, BALuong, CMartelli, AMcGee, DRadika, KSendzik, MSpencer, JRSprengeler, PATario, JVerner, EWang, J 2-(2-Hydroxy-3-alkoxyphenyl)-1H-benzimidazole-5-carboxamidine derivatives as potent and selective urokinase-type plasminogen activator inhibitors. Bioorg Med Chem Lett 12:2019-22 (2002)  
Target
Name:
Coagulation factor X
Synonyms:
Activated coagulation factor X (FXa) Coagulation factor X precursor F10 Factor X heavy chain Factor Xa Stuart-Prower factor
Type:
Enzyme
Mol. Mass.:
54726.60
Organism:
Homo sapiens (Human)
Description:
Residue:
488
  
Inhibitor
Name:
BDBM50115861
Synonyms:
2-(3-Cyclopentyloxy-2-hydroxy-phenyl)-1H-benzoimidazole-5-carboxamidine CHEMBL303992
Type:
Small organic molecule
Emp. Form.:
C19H20N4O2
Mol. Mass.:
336.3877
SMILES:
NC(=N)c1ccc2nc([nH]c2c1)-c1cccc(OC2CCCC2)c1O
: