Target
Urokinase-type plasminogen activator
Ligand
BDBM50115861
Substrate
Meas. Tech.
ChEBML_213307
Ki
220±n/a nM
Citation
 Mackman, RLHui, HCBreitenbucher, JGKatz, BALuong, CMartelli, AMcGee, DRadika, KSendzik, MSpencer, JRSprengeler, PATario, JVerner, EWang, J 2-(2-Hydroxy-3-alkoxyphenyl)-1H-benzimidazole-5-carboxamidine derivatives as potent and selective urokinase-type plasminogen activator inhibitors. Bioorg Med Chem Lett 12:2019-22 (2002)  
Target
Name:
Urokinase-type plasminogen activator
Synonyms:
3.4.21.73 U-plasminogen activator Urokinase Urokinase-type plasminogen activator chain B Urokinase-type plasminogen activator short chain A uPA
Type:
Enzyme
Mol. Mass.:
48528.62
Organism:
Homo sapiens (Human)
Description:
P00749
Residue:
431
  
Inhibitor
Name:
BDBM50115861
Synonyms:
2-(3-Cyclopentyloxy-2-hydroxy-phenyl)-1H-benzoimidazole-5-carboxamidine CHEMBL303992
Type:
Small organic molecule
Emp. Form.:
C19H20N4O2
Mol. Mass.:
336.3877
SMILES:
NC(=N)c1ccc2nc([nH]c2c1)-c1cccc(OC2CCCC2)c1O
: