Target
Urokinase-type plasminogen activator
Ligand
BDBM50115886
Substrate
Meas. Tech.
ChEBML_213308
Ki
1000±n/a nM
Citation
 Spencer, JRMcGee, DAllen, DKatz, BALuong, CSendzik, MSquires, NMackman, RL 4-Aminoarylguanidine and 4-aminobenzamidine derivatives as potent and selective urokinase-type plasminogen activator inhibitors. Bioorg Med Chem Lett 12:2023-6 (2002)  
Target
Name:
Urokinase-type plasminogen activator
Synonyms:
3.4.21.73 U-plasminogen activator Urokinase Urokinase-type plasminogen activator chain B Urokinase-type plasminogen activator short chain A uPA
Type:
Enzyme
Mol. Mass.:
48528.62
Organism:
Homo sapiens (Human)
Description:
P00749
Residue:
431
  
Inhibitor
Name:
BDBM50115886
Synonyms:
CHEMBL64096 | N-(4-Carbamimidoyl-phenyl)-2-hydroxy-4-methyl-benzamide
Type:
Small organic molecule
Emp. Form.:
C15H15N3O2
Mol. Mass.:
269.2985
SMILES:
Cc1ccc(C(=O)Nc2ccc(cc2)C(N)=N)c(O)c1
: