Target
Plasminogen
Ligand
BDBM50115902
Substrate
Meas. Tech.
ChEBML_155435
Ki
75000±n/a nM
Citation
 Spencer, JRMcGee, DAllen, DKatz, BALuong, CSendzik, MSquires, NMackman, RL 4-Aminoarylguanidine and 4-aminobenzamidine derivatives as potent and selective urokinase-type plasminogen activator inhibitors. Bioorg Med Chem Lett 12:2023-6 (2002)  
Target
Name:
Plasminogen
Synonyms:
Activation peptide PLG Plasmin Plasmin heavy chain A, short form | Plasmin light chain B
Type:
Enzyme
Mol. Mass.:
90579.18
Organism:
Homo sapiens (Human)
Description:
Residue:
810
  
Inhibitor
Name:
BDBM50115902
Synonyms:
3-Hydroxy-4-isopropoxy-anthracene-2-carboxylic acid (4-guanidino-phenyl)-amide | CHEMBL304219
Type:
Small organic molecule
Emp. Form.:
C25H24N4O3
Mol. Mass.:
428.4831
SMILES:
CC(C)Oc1c(O)c(cc2cc3ccccc3cc12)C(=O)Nc1ccc(cc1)N=C(N)N
: