Target
Urokinase-type plasminogen activator
Ligand
BDBM50115896
Substrate
Meas. Tech.
ChEBML_213308
Ki
180±n/a nM
Citation
 Spencer, JRMcGee, DAllen, DKatz, BALuong, CSendzik, MSquires, NMackman, RL 4-Aminoarylguanidine and 4-aminobenzamidine derivatives as potent and selective urokinase-type plasminogen activator inhibitors. Bioorg Med Chem Lett 12:2023-6 (2002)  
Target
Name:
Urokinase-type plasminogen activator
Synonyms:
3.4.21.73 U-plasminogen activator Urokinase Urokinase-type plasminogen activator chain B Urokinase-type plasminogen activator short chain A uPA
Type:
Enzyme
Mol. Mass.:
48528.62
Organism:
Homo sapiens (Human)
Description:
P00749
Residue:
431
  
Inhibitor
Name:
BDBM50115896
Synonyms:
3-Hydroxy-4-isopropoxy-anthracene-2-carboxylic acid (6-guanidino-pyridin-3-yl)-amide | CHEMBL63216
Type:
Small organic molecule
Emp. Form.:
C24H23N5O3
Mol. Mass.:
429.4711
SMILES:
CC(C)Oc1c(O)c(cc2cc3ccccc3cc12)C(=O)Nc1ccc(N=C(N)N)nc1
: