Target
Urokinase-type plasminogen activator
Ligand
BDBM50115902
Substrate
Meas. Tech.
ChEBML_213308
Ki
230±n/a nM
Citation
 Spencer, JRMcGee, DAllen, DKatz, BALuong, CSendzik, MSquires, NMackman, RL 4-Aminoarylguanidine and 4-aminobenzamidine derivatives as potent and selective urokinase-type plasminogen activator inhibitors. Bioorg Med Chem Lett 12:2023-6 (2002)  
Target
Name:
Urokinase-type plasminogen activator
Synonyms:
3.4.21.73 U-plasminogen activator Urokinase Urokinase-type plasminogen activator chain B Urokinase-type plasminogen activator short chain A uPA
Type:
Enzyme
Mol. Mass.:
48528.62
Organism:
Homo sapiens (Human)
Description:
P00749
Residue:
431
  
Inhibitor
Name:
BDBM50115902
Synonyms:
3-Hydroxy-4-isopropoxy-anthracene-2-carboxylic acid (4-guanidino-phenyl)-amide | CHEMBL304219
Type:
Small organic molecule
Emp. Form.:
C25H24N4O3
Mol. Mass.:
428.4831
SMILES:
CC(C)Oc1c(O)c(cc2cc3ccccc3cc12)C(=O)Nc1ccc(cc1)N=C(N)N
: