Target
Tissue-type plasminogen activator
Ligand
BDBM50115902
Substrate
Meas. Tech.
ChEMBL_208243 (CHEMBL877957)
Ki
>563000±n/a nM
Citation
 Spencer, JRMcGee, DAllen, DKatz, BALuong, CSendzik, MSquires, NMackman, RL 4-Aminoarylguanidine and 4-aminobenzamidine derivatives as potent and selective urokinase-type plasminogen activator inhibitors. Bioorg Med Chem Lett 12:2023-6 (2002)  
Target
Name:
Tissue-type plasminogen activator
Synonyms:
Alteplase Reteplase Thrombin receptor protein Tissue-type plasminogen activator (tPA) t-PA t-plasminogen activator
Type:
Enzyme
Mol. Mass.:
62931.08
Organism:
Homo sapiens (Human)
Description:
Residue:
562
  
Inhibitor
Name:
BDBM50115902
Synonyms:
3-Hydroxy-4-isopropoxy-anthracene-2-carboxylic acid (4-guanidino-phenyl)-amide | CHEMBL304219
Type:
Small organic molecule
Emp. Form.:
C25H24N4O3
Mol. Mass.:
428.4831
SMILES:
CC(C)Oc1c(O)c(cc2cc3ccccc3cc12)C(=O)Nc1ccc(cc1)N=C(N)N
: