Target
Inward rectifier potassium channel 2
Ligand
BDBM328993
Substrate
Meas. Tech.
ChEMBL_2051989 (CHEMBL4706990)
IC50
>10000±n/a nM
Citation
 Osborne, JDMatthews, TPMcHardy, TProisy, NCheung, KMLainchbury, MBrown, NWalton, MIEve, PDBoxall, KJHayes, AHenley, ATValenti, MRDe Haven Brandon, AKBox, GJamin, YRobinson, SPWestwood, IMvan Montfort, RLLeonard, PMLamers, MBReader, JCAherne, GWRaynaud, FIEccles, SAGarrett, MDCollins, I Multiparameter Lead Optimization to Give an Oral Checkpoint Kinase 1 (CHK1) Inhibitor Clinical Candidate: (R)-5-((4-((Morpholin-2-ylmethyl)amino)-5-(trifluoromethyl)pyridin-2-yl)amino)pyrazine-2-carbonitrile (CCT245737). J Med Chem 59:5221-37 (2016)  
Target
Name:
Inward rectifier potassium channel 2
Synonyms:
Cardiac inward rectifier potassium channel IRK1 KCNJ2 Potassium channel, inwardly rectifying subfamily J member 2 | hIRK1
Type:
PROTEIN
Mol. Mass.:
48281.20
Organism:
Homo sapiens (Human)
Description:
ChEMBL_1515520
Residue:
427
  
Inhibitor
Name:
BDBM328993
Synonyms:
5-[[4-[[(2R)-morpholin-2-yl]methylamino]-5-(trifluoromethyl)-2-pyridyl]amino]pyrazine-2-carbonitrile US9663503, Compound 1
Type:
Small organic molecule
Emp. Form.:
C16H16F3N7O
Mol. Mass.:
379.3397
SMILES:
FC(F)(F)c1cnc(Nc2cnc(cn2)C#N)cc1NC[C@H]1CNCCO1
: