Target
Gonadotropin-releasing hormone receptor
Ligand
BDBM50116230
Substrate
Meas. Tech.
ChEBML_71597
Ki
56±n/a nM
Citation
 Gross, TDZhu, YFSaunders, JWilcoxen, KMGao, YConnors, PJGuo, ZStruthers, RSReinhart, GJChen, C Design, synthesis and structure-activity relationships of novel imidazolo[1,2-a]pyrimid-5-ones as potent GnRH receptor antagonists. Bioorg Med Chem Lett 12:2185-7 (2002)  
Target
Name:
Gonadotropin-releasing hormone receptor
Synonyms:
GNRHR GRHR GnRH-R Gonadotropin-releasing hormone receptor | Gonadotropin-releasing hormone receptor (GnRH)
Type:
Enzyme
Mol. Mass.:
37749.45
Organism:
Homo sapiens (Human)
Description:
P30968
Residue:
328
  
Inhibitor
Name:
BDBM50116230
Synonyms:
8-(2-Fluoro-benzyl)-6-(3-mercapto-phenyl)-2-(4-methoxy-phenyl)-7-methyl-3-{[methyl-(2-pyridin-2-yl-ethyl)-amino]-methyl}-8H-imidazo[1,2-a]pyrimidin-5-one | CHEMBL303621
Type:
Small organic molecule
Emp. Form.:
C36H34FN5O2S
Mol. Mass.:
619.751
SMILES:
COc1ccc(cc1)-c1nc2n(Cc3ccccc3F)c(C)c(-c3cccc(S)c3)c(=O)n2c1CN(C)CCc1ccccn1
: