Target
Metabotropic glutamate receptor 6
Ligand
BDBM50094841
Substrate
Meas. Tech.
ChEMBL_2053749 (CHEMBL4708750)
IC50
>30000±n/a nM
Citation
 Urabe, HMiyakoshi, NOhtake, NNozoe, AOchi, MFukasawa, MKinoshita, KYamaguchi, JIMarumo, THikichi, HChaki, SHashihayata, T Discovery of MGS0274, an ester prodrug of a metabotropic glutamate receptor 2/3 agonist with improved oral bioavailability. Eur J Med Chem 203:0 (2020)  
Target
Name:
Metabotropic glutamate receptor 6
Synonyms:
GPRC1F GRM6_HUMAN Metabotropic glutamate receptor 6 metabotropic glutamate 6
Type:
Enzyme Catalytic Domain
Mol. Mass.:
95479.26
Organism:
Homo sapiens (Human)
Description:
metabotropic glutamate 6 GRM6 HUMAN::O15303
Residue:
877
  
Inhibitor
Name:
BDBM50094841
Synonyms:
(+)-2-Amino-3-fluoro-bicyclo[3.1.0]hexane-2,6-dicarboxylic acid (1S,2S,3S,5R,6S)-2-amino-3-fluorobicyclo[3.1.0]hexane-2,6-dicarboxylic acid CHEMBL334014
Type:
Small organic molecule
Emp. Form.:
C8H10FNO4
Mol. Mass.:
203.1677
SMILES:
N[C@@]1([C@H]2[C@@H](C[C@@H]1F)[C@@H]2C(O)=O)C(O)=O
: