Target
Nuclear factor erythroid 2-related factor 2
Ligand
BDBM50556023
Substrate
Meas. Tech.
ChEMBL_2054557 (CHEMBL4709558)
IC50
160±n/a nM
Citation
 Lu, MCShao, HLLiu, TYou, QDJiang, ZY Discovery of 2-oxy-2-phenylacetic acid substituted naphthalene sulfonamide derivatives as potent KEAP1-NRF2 protein-protein interaction inhibitors for inflammatory conditions. Eur J Med Chem 207:0 (2020)  
Target
Name:
Nuclear factor erythroid 2-related factor 2
Synonyms:
HEBP1 NF-E2-related factor 2 NFE2-related factor 2 NRF2 Nuclear factor, erythroid derived 2, like 2
Type:
PROTEIN
Mol. Mass.:
67786.89
Organism:
Homo sapiens (Human)
Description:
ChEMBL_107924
Residue:
605
  
Inhibitor
Name:
BDBM50556023
Synonyms:
CHEMBL4796980
Type:
Small organic molecule
Emp. Form.:
C29H27NO8S
Mol. Mass.:
549.592
SMILES:
Cc1cc(C)c(c(C)c1)S(=O)(=O)N(CC(O)=O)c1ccc(OC(C(O)=O)c2ccc(O)cc2)c2ccccc12
: