Target
Nuclear factor erythroid 2-related factor 2
Ligand
BDBM415702
Substrate
Meas. Tech.
ChEMBL_2054557 (CHEMBL4709558)
IC50
75±n/a nM
Citation
 Lu, MCShao, HLLiu, TYou, QDJiang, ZY Discovery of 2-oxy-2-phenylacetic acid substituted naphthalene sulfonamide derivatives as potent KEAP1-NRF2 protein-protein interaction inhibitors for inflammatory conditions. Eur J Med Chem 207:0 (2020)  
Target
Name:
Nuclear factor erythroid 2-related factor 2
Synonyms:
HEBP1 NF-E2-related factor 2 NFE2-related factor 2 NRF2 Nuclear factor, erythroid derived 2, like 2
Type:
PROTEIN
Mol. Mass.:
67786.89
Organism:
Homo sapiens (Human)
Description:
ChEMBL_107924
Residue:
605
  
Inhibitor
Name:
BDBM415702
Synonyms:
US10442759, Compound I-14
Type:
Small organic molecule
Emp. Form.:
C30H29NO8S
Mol. Mass.:
563.618
SMILES:
COc1ccc(cc1)C(Oc1ccc(N(CC(O)=O)S(=O)(=O)c2c(C)cc(C)cc2C)c2ccccc12)C(O)=O
: