Target
Cyclin-T1/Cyclin-dependent kinase 9
Ligand
BDBM50556033
Substrate
Meas. Tech.
ChEMBL_2054750 (CHEMBL4709751)
IC50
104±n/a nM
Citation
 Mäder, PKattner, L Sulfoximines as Rising Stars in Modern Drug Discovery? Current Status and Perspective on an Emerging Functional Group in Medicinal Chemistry. J Med Chem 63:14243-14275 (2020)  
Target
Name:
Cyclin-T1/Cyclin-dependent kinase 9
Synonyms:
CDK9/ Cyclin-T1 CDK9/Cyclin T Cyclin T1/dependent kinase 9 | Cyclin-Dependent Kinase 9 (CDK9)
Type:
Protein Complex
Mol. Mass.:
Description:
Components:
This complex has 2 components.
Component 1
Name:
Cyclin-T1
Synonyms:
CCNT1 CycT Cyclin T Cyclin-T
Type:
Enzyme Subunit
Mol. Mass.:
80712.40
Organism:
Homo sapiens (Human)
Description:
Residue:
726
  
Component 2
Name:
Cyclin-dependent kinase 9
Synonyms:
C-2K CDK9 Cell division cycle 2-like protein kinase 4 Cyclin-Dependent Kinase 9 (CDK9) Serine/threonine-protein kinase PITALRE Tat-associated kinase complex catalytic subunit
Type:
Enzyme Subunit
Mol. Mass.:
42789.13
Organism:
Homo sapiens (Human)
Description:
Residue:
372
  
Inhibitor
Name:
BDBM50556033
Synonyms:
CHEMBL4793497
Type:
Small organic molecule
Emp. Form.:
C19H18F3N5OS
Mol. Mass.:
421.439
SMILES:
COc1cc(F)ccc1-c1nc(Nc2cc(F)cc(CS(C)(=N)=N)c2)ncc1F
: