Target
Dipeptidyl peptidase 4
Ligand
BDBM185582
Substrate
Meas. Tech.
ChEMBL_2054760 (CHEMBL4709761)
IC50
37±n/a nM
Citation
 Mäder, PKattner, L Sulfoximines as Rising Stars in Modern Drug Discovery? Current Status and Perspective on an Emerging Functional Group in Medicinal Chemistry. J Med Chem 63:14243-14275 (2020)  
Target
Name:
Dipeptidyl peptidase 4
Synonyms:
ADABP Adenosine deaminase complexing protein 2 CD_antigen=CD26 DPP4 DPPIV Dipeptidyl peptidase 4 (DPP IV) Dipeptidyl peptidase 4 (DPP4) Dipeptidyl peptidase 4 membrane form Dipeptidyl peptidase IV Dipeptidyl peptidase IV (DDP-IV) Dipeptidyl peptidase IV membrane form Dipeptidyl peptidase-IV (DPP-4) T-cell activation antigen CD26 | TP103
Type:
Enzyme
Mol. Mass.:
88271.01
Organism:
Homo sapiens (Human)
Description:
P27487
Residue:
766
  
Inhibitor
Name:
BDBM185582
Synonyms:
US9156848, 3
Type:
Small organic molecule
Emp. Form.:
C18H22F2N4O3S
Mol. Mass.:
412.454
SMILES:
C[C@@]1(CO[C@@H]([C@@H](N)C1)c1cc(F)ccc1F)N1Cc2cn(nc2C1)S(C)(=O)=O
: