Target
Beta-secretase 1
Ligand
BDBM312923
Substrate
Meas. Tech.
ChEMBL_2054773 (CHEMBL4709774)
IC50
0.200000±n/a nM
Citation
 Mäder, PKattner, L Sulfoximines as Rising Stars in Modern Drug Discovery? Current Status and Perspective on an Emerging Functional Group in Medicinal Chemistry. J Med Chem 63:14243-14275 (2020)  
Target
Name:
Beta-secretase 1
Synonyms:
ASP2 Aspartyl protease 2 BACE1 Beta-secretase (BACE) Beta-secretase 1 (BACE 1) Beta-secretase 1 (BACE1) Beta-site amyloid precursor protein cleaving enzyme 1 Memapsin-2 beta-Secretase (BACE-1) | beta-Secretase (BACE1)
Type:
Protein
Mol. Mass.:
55755.10
Organism:
Homo sapiens (Human)
Description:
P56817
Residue:
501
  
Inhibitor
Name:
BDBM312923
Synonyms:
5-But-2-ynyloxy-pyrazine-2-carboxylic acid [3-((3R,4aS)-1-amino-3-methyl-4a-oxo-3,4,6,7,8,9-hexahydro-4a¿6-thia-2,5,9a-triaza-benzocyclohepten-3-yl)-4-fluoro-phenyl]-amide | US9605006, 22
Type:
Small organic molecule
Emp. Form.:
C23H26FN7O3S
Mol. Mass.:
499.561
SMILES:
CC#CCOc1cnc(cn1)C(=O)Nc1ccc(F)c(c1)[C@]1(C)C[S@@]2(=O)=NCCCCN2C(N)=N1
: