Target
Substance-K receptor
Ligand
BDBM50116745
Substrate
Meas. Tech.
ChEBML_209036
Ki
0.200000±n/a nM
Citation
 Reichard, GAGrice, CAShih, NYSpitler, JMajmundar, SWang, SDPaliwal, SAnthes, JCPiwinski, JJ Preparation of oxime dual NK(1)/NK(2) antagonists with reduced NK(3) affinity. Bioorg Med Chem Lett 12:2355-8 (2002)  
Target
Name:
Substance-K receptor
Synonyms:
NK-2 receptor NK2R NKNAR Neurokinin A receptor Neurokinin-2 (NK-2) SKR TACR2 Tachykinin receptor 2 (NK2) | hnk-3
Type:
Protein
Mol. Mass.:
44455.78
Organism:
Homo sapiens (Human)
Description:
P21452
Residue:
398
  
Inhibitor
Name:
BDBM50116745
Synonyms:
CHEMBL78284 | N-{(R)-5-[4-(3-Carbamoylmethyl-2-oxo-tetrahydro-pyrimidin-1-yl)-piperidin-1-yl]-3-(3,4-dichloro-phenyl)-2-[(Z)-methoxyimino]-pentyl}-3,5-dichloro-N-methyl-benzamide
Type:
Small organic molecule
Emp. Form.:
C31H38Cl4N6O4
Mol. Mass.:
700.483
SMILES:
CO\N=C(/CN(C)C(=O)c1cc(Cl)cc(Cl)c1)[C@H](CCN1CCC(CC1)N1CCCN(CC(N)=O)C1=O)c1ccc(Cl)c(Cl)c1
: