Target
Bromodomain-containing protein 4
Ligand
BDBM50399434
Substrate
Meas. Tech.
ChEMBL_2055381 (CHEMBL4710382)
IC50
88±n/a nM
Citation
 Xu, YZhang, XJLi, WBWang, XRWang, SQiao, XPChen, SW Design, synthesis and biological evaluation of indole-2-one derivatives as potent BRD4 inhibitors. Eur J Med Chem 208:0 (2020)  
Target
Name:
Bromodomain-containing protein 4
Synonyms:
BRD4 Bromodomain-containing protein 4 (BRD4) Protein HUNK1
Type:
Protein
Mol. Mass.:
152264.84
Organism:
Homo sapiens (Human)
Description:
O60885
Residue:
1362
  
Inhibitor
Name:
BDBM50399434
Synonyms:
CHEMBL2179387
Type:
Small organic molecule
Emp. Form.:
C16H17N3O4S
Mol. Mass.:
347.389
SMILES:
COc1ccccc1S(=O)(=O)Nc1ccc2NC(=O)N(C)Cc2c1
: