Target
Anoctamin-1
Ligand
BDBM50239459
Substrate
Meas. Tech.
ChEMBL_2055536 (CHEMBL4710537)
IC50
50±n/a nM
Citation
 Choi, SHRyu, SSim, KSong, CShin, IKim, SSLee, YSPark, JYSim, T Anti-glioma effects of 2-aminothiophene-3-carboxamide derivatives, ANO1 channel blockers. Eur J Med Chem 208:0 (2020)  
Target
Name:
Anoctamin-1
Synonyms:
ANO1_MOUSE Anoctamin-1 Transmembrane protein 16A
Type:
PROTEIN
Mol. Mass.:
110928.38
Organism:
Mus musculus
Description:
ChEMBL_117479
Residue:
960
  
Inhibitor
Name:
BDBM50239459
Synonyms:
CHEMBL4074929
Type:
Small organic molecule
Emp. Form.:
C19H19BrF2N2O2S
Mol. Mass.:
457.332
SMILES:
Cc1ccccc1NC(=O)c1c(NC(=O)C(F)(F)Br)sc2CCCCCc12
: