Target
5-hydroxytryptamine receptor 7
Ligand
BDBM50116956
Substrate
Meas. Tech.
ChEBML_3696
Ki
70±n/a nM
Citation
 Isaac, MBXin, TO'Brien, ASt-Martin, DNaismith, AMacLean, NWilson, JDemchyshyn, LTehim, ASlassi, A 1-(Bicyclopiperazinyl)ethylindoles and 1-(homopiperazinyl)ethyl-indoles as highly selective and potent 5-HT(7) receptor ligands. Bioorg Med Chem Lett 12:2451-4 (2002)  
Target
Name:
5-hydroxytryptamine receptor 7
Synonyms:
5-HT-7 5-HT7 5-HT7S 5HT7 HTR7 | Serotonin receptor 7
Type:
G Protein-Coupled Receptor (GPCR)
Mol. Mass.:
53573.08
Organism:
Homo sapiens (Human)
Description:
P34969
Residue:
479
  
Inhibitor
Name:
BDBM50116956
Synonyms:
6-Isopropenyl-1-[2-(4-methyl-[1,4]diazepan-1-yl)-ethyl]-1H-indole | CHEMBL310317
Type:
Small organic molecule
Emp. Form.:
C19H27N3
Mol. Mass.:
297.4378
SMILES:
CN1CCCN(CCn2ccc3ccc(cc23)C(C)=C)CC1
: