Target
Vasopressin V2 receptor
Ligand
BDBM50117486
Substrate
Meas. Tech.
ChEMBL_214876 (CHEMBL872576)
IC50
230±n/a nM
Citation
 Kondo, KKan, KTanada, YBando, MShinohara, TKurimura, MOgawa, HNakamura, SHirano, TYamamura, YKido, MMori, TTominaga, M Characterization of orally active nonpeptide vasopressin V(2) receptor agonist. Synthesis and biological evaluation of both the (5R)- and (5S)-enantioisomers of 2-[1-(2-Chloro-4-pyrrolidin-1-yl-benzoyl)-2,3,4,5-tetrahydro-1H-1-benzazepin- 5-yl]-N-isopropylacetamide. J Med Chem 45:3805-8 (2002)  
Target
Name:
Vasopressin V2 receptor
Synonyms:
AVPR V2 Avpr2 V2R_RAT Vasopressin receptor
Type:
G-protein coupled receptor
Mol. Mass.:
40761.85
Organism:
Rattus norvegicus (Rat)
Description:
Residue:
371
  
Inhibitor
Name:
BDBM50117486
Synonyms:
2-[(R)-1-(2-Chloro-4-pyrrolidin-1-yl-benzoyl)-2,3,4,5-tetrahydro-1H-benzo[b]azepin-5-yl]-N-isopropyl-acetamide CHEMBL332447
Type:
Small organic molecule
Emp. Form.:
C26H32ClN3O2
Mol. Mass.:
454.004
SMILES:
CC(C)NC(=O)C[C@H]1CCCN(C(=O)c2ccc(cc2Cl)N2CCCC2)c2ccccc12
: