Target
Ephrin type-A receptor 1
Ligand
BDBM50556597
Substrate
Meas. Tech.
ChEMBL_2056726 (CHEMBL4711727)
IC50
>20000±n/a nM
Citation
 Röhm, SSchröder, MDwyer, JEWiddowson, CSChaikuad, ABerger, BTJoerger, ACKrämer, AHarbig, JDauch, DKudolo, MLaufer, SBagley, MCKnapp, S Selective targeting of the ?C and DFG-out pocket in p38 MAPK. Eur J Med Chem 208:0 (2020)  
Target
Name:
Ephrin type-A receptor 1
Synonyms:
EPH EPH tyrosine kinase 1 EPHA1_HUMAN EPHT1 Ephrin type-A receptor 1 Erythropoietin-producing hepatoma receptor hEpha1
Type:
Enzyme
Mol. Mass.:
108128.04
Organism:
Homo sapiens (Human)
Description:
P21709
Residue:
976
  
Inhibitor
Name:
BDBM50556597
Synonyms:
CHEMBL4756586
Type:
Small organic molecule
Emp. Form.:
C30H38N6O3
Mol. Mass.:
530.6611
SMILES:
CCNC(=O)[C@H](CCC1CCCCC1)NC(=O)c1ccc(CNC(=O)c2cnn(c2N)-c2ccccc2)cc1
: