Target
Prostaglandin G/H synthase 1
Ligand
BDBM50556688
Substrate
Meas. Tech.
ChEMBL_2056913 (CHEMBL4711914)
IC50
150±n/a nM
Citation
 Perrone, MGMiciaccia, MVitale, PFerorelli, SAraújo, CDCBde Almeida, GSSouza Domingos, TFda Silva, LCRPde Pádula, MCabral, LMSathler, PCBonaccorso, CFortuna, CGScilimati, A An attempt to chemically state the cross-talk between monomers of COX homodimers by double/hybrid inhibitors mofezolac-spacer-mofezolac and mofezolac-spacer-arachidonic acid. Eur J Med Chem 209:0 (2021)  
Target
Name:
Prostaglandin G/H synthase 1
Synonyms:
COX1 Cyclooxygenase-1 (COX-1) PTGS1 | Prostaglandin G/H synthase (cyclooxygenase)
Type:
Protein
Mol. Mass.:
68868.60
Organism:
Ovis aries (Sheep)
Description:
Residue:
600
  
Inhibitor
Name:
BDBM50556688
Synonyms:
CHEMBL4744394
Type:
Small organic molecule
Emp. Form.:
C50H58N4O8
Mol. Mass.:
843.0175
SMILES:
COc1ccc(cc1)-c1noc(CC(=O)NCCCCCCCCCCCCNC(=O)Cc2onc(c2-c2ccc(OC)cc2)-c2ccc(OC)cc2)c1-c1ccc(OC)cc1
: