Target
Prostaglandin E2 receptor EP3 subtype
Ligand
BDBM50117700
Substrate
Meas. Tech.
ChEBML_158321
Ki
16±n/a nM
Citation
 Gallant, MCarrière, MCChateauneuf, ADenis, DGareau, YGodbout, CGreig, GJuteau, HLachance, NLacombe, PLamontagne, SMetters, KMRochette, CRuel, RSlipetz, DSawyer, NTremblay, NLabelle, M Structure-activity relationship of biaryl acylsulfonamide analogues on the human EP(3) prostanoid receptor. Bioorg Med Chem Lett 12:2583-6 (2002)  
Target
Name:
Prostaglandin E2 receptor EP3 subtype
Synonyms:
PE2R3_HUMAN PGE2-R Prostaglandin E2 receptor Prostaglandin E2 receptor EP3 subtype (EP3) Prostaglandin E2 receptor EP3D subtype (EP3D) | Prostanoid EP3 receptor
Type:
Enzyme
Mol. Mass.:
43335.03
Organism:
Homo sapiens (Human)
Description:
P43115
Residue:
390
  
Inhibitor
Name:
BDBM50117700
Synonyms:
CHEMBL87366 | Thiophene-2-sulfonic acid (3-{4'-[3-(3-phenethylsulfanylmethyl-phenoxy)-propoxy]-biphenyl-2-yl}-propionyl)-amide
Type:
Small organic molecule
Emp. Form.:
C37H37NO5S3
Mol. Mass.:
671.888
SMILES:
O=C(CCc1ccccc1-c1ccc(OCCCOc2cccc(CSCCc3ccccc3)c2)cc1)NS(=O)(=O)c1cccs1
: