Target
Signal transducer and activator of transcription 3
Ligand
BDBM50556876
Substrate
Meas. Tech.
ChEMBL_2057493 (CHEMBL4712494)
IC50
580±n/a nM
Citation
 Brotherton-Pleiss, CYue, PZhu, YNakamura, KChen, WFu, WKubota, CChen, JAlonso-Valenteen, FMikhael, SMedina-Kauwe, LTius, MALopez-Tapia, FTurkson, J Discovery of Novel Azetidine Amides as Potent Small-Molecule STAT3 Inhibitors. J Med Chem 64:695-710 (2021)  
Target
Name:
Signal transducer and activator of transcription 3
Synonyms:
Acute-phase response factor STAT3 alpha Signal transducer and activator of transcription 3 Transcription Factor STAT3
Type:
Cytosolic Transcription Factor
Mol. Mass.:
88050.28
Organism:
Mus musculus (mouse)
Description:
Bacterially expressed protein was used in the FP assay.
Residue:
770
  
Inhibitor
Name:
BDBM50556876
Synonyms:
CHEMBL4743282
Type:
Small organic molecule
Emp. Form.:
C30H26F5N2NaO6S
Mol. Mass.:
660.584
SMILES:
[Na;v0+].[#8]-c1cc(ccc1-[#6](-[#8-])=O)-[#7](-[#6]-c1ccc(cc1)-[#6]-1-[#6]-[#6]-[#6]-[#6]-[#6]-1)-[#6](=O)-[#6@H]-1-[#6]-[#6]-[#7]-1S(=O)(=O)c1c(F)c(F)c(F)c(F)c1F
: