Target
Signal transducer and activator of transcription 3
Ligand
BDBM549075
Substrate
Meas. Tech.
ChEMBL_2057493 (CHEMBL4712494)
IC50
520±n/a nM
Citation
 Brotherton-Pleiss, CYue, PZhu, YNakamura, KChen, WFu, WKubota, CChen, JAlonso-Valenteen, FMikhael, SMedina-Kauwe, LTius, MALopez-Tapia, FTurkson, J Discovery of Novel Azetidine Amides as Potent Small-Molecule STAT3 Inhibitors. J Med Chem 64:695-710 (2021)  
Target
Name:
Signal transducer and activator of transcription 3
Synonyms:
Acute-phase response factor STAT3 alpha Signal transducer and activator of transcription 3 Transcription Factor STAT3
Type:
Cytosolic Transcription Factor
Mol. Mass.:
88050.28
Organism:
Mus musculus (mouse)
Description:
Bacterially expressed protein was used in the FP assay.
Residue:
770
  
Inhibitor
Name:
BDBM549075
Synonyms:
BDBM50556877 | US11299480, Example 34
Type:
Small organic molecule
Emp. Form.:
C30H27F5N2O6S
Mol. Mass.:
638.602
SMILES:
OC(=O)c1ccc(cc1O)N(Cc1ccc(cc1)C1CCCCC1)C(=O)[C@H]1CCN1S(=O)(=O)c1c(F)c(F)c(F)c(F)c1F
: