Target
Amine oxidase [flavin-containing] A
Ligand
BDBM50557339
Substrate
Meas. Tech.
ChEMBL_2058916 (CHEMBL4713917)
Ki
1.000000±n/a nM
Citation
 Salgin-Goksen, UTelli, GErikci, ADedecengiz, ETel, BCKaynak, FBYelekci, KUcar, GGokhan-Kelekci, N New 2-Pyrazoline and Hydrazone Derivatives as Potent and Selective Monoamine Oxidase A Inhibitors. J Med Chem 64:1989-2009 (2021)  
Target
Name:
Amine oxidase [flavin-containing] A
Synonyms:
AOFA_HUMAN MAO-A Monoamine oxidase Monoamine oxidase type A (MAO A) Monoamine oxidase type A (MAOA)
Type:
Protein
Mol. Mass.:
59689.53
Organism:
Homo sapiens (Human)
Description:
P21397
Residue:
527
  
Inhibitor
Name:
BDBM50557339
Synonyms:
CHEMBL4748517
Type:
Small organic molecule
Emp. Form.:
C25H20ClN3O4
Mol. Mass.:
461.897
SMILES:
COc1ccc(cc1)C1=NN(C(C1)c1ccccc1Cl)C(=O)Cn1c2ccccc2oc1=O
: