Target
Bcl-2-like protein 1
Ligand
BDBM139041
Substrate
Meas. Tech.
ChEMBL_2060597 (CHEMBL4715598)
Kd
0.400000±n/a nM
Citation
 Tao, ZFWang, XChen, JIngram, JPJin, SJudge, RAKovar, PJPark, CSun, CWakefield, BDZhou, LZhang, HElmore, SWPhillips, DCJudd, ASLeverson, JDSouers, AJ Structure-Based Design of A-1293102, a Potent and Selective BCL-X ACS Med Chem Lett 12:1011-1016 (2021)  
Target
Name:
Bcl-2-like protein 1
Synonyms:
Anti-apoptotic Bcl-2 protein Apoptosis regulator Bcl-X BCL2-like 1 isoform 1 BCL2L1 Bcl-2-like protein 1 (Bcl-XL) Bcl-xL/Bcl-2-binding component 3 Bcl2-antagonist of cell death (BAD)
Type:
Mitochondrion membrane; Single-pass membrane protein
Mol. Mass.:
26039.60
Organism:
Homo sapiens (Human)
Description:
Residue:
233
  
Inhibitor
Name:
BDBM139041
Synonyms:
US8883784, 2
Type:
Small organic molecule
Emp. Form.:
C42H40F3N7O7S5
Mol. Mass.:
972.13
SMILES:
FC(F)(F)S(=O)(=O)c1cc(ccc1N[C@H](CCN1CCOCC1)CSc1ccccc1)S(=O)(=O)NC(=O)c1csc(n1)N1CCc2cccc(C(=O)Nc3nc4ccccc4s3)c2C1
: