Target
Sodium channel protein type 9 subunit alpha
Ligand
BDBM50240278
Substrate
Meas. Tech.
ChEMBL_2060624 (CHEMBL4715625)
IC50
220±n/a nM
Citation
 Roecker, AJLayton, MEPero, JEKelly, MJGreshock, TJKraus, RLLi, YKlein, RClements, MDaley, CJovanovska, ABallard, JEWang, DZhao, FBrunskill, APJPeng, XWang, XSun, HHoughton, AKBurgey, CS Discovery of Arylsulfonamide Na ACS Med Chem Lett 12:1038-1049 (2021)  
Target
Name:
Sodium channel protein type 9 subunit alpha
Synonyms:
Kiaa4197 Peripheral sodium channel 1 Scn9a Sodium channel protein type IX subunit alpha | Voltage-gated sodium channel subunit alpha Nav1.7
Type:
PROTEIN
Mol. Mass.:
225808.99
Organism:
Mus musculus
Description:
ChEMBL_109594
Residue:
1984
  
Inhibitor
Name:
BDBM50240278
Synonyms:
CHEMBL4062780
Type:
Small organic molecule
Emp. Form.:
C19H24ClFN4O2S2
Mol. Mass.:
459.001
SMILES:
CC1(C)CN2CCC[C@]2(CNc2cc(F)c(cc2Cl)S(=O)(=O)Nc2nccs2)C1
: