Target
ALK tyrosine kinase receptor
Ligand
BDBM243386
Substrate
Meas. Tech.
ChEMBL_2060934 (CHEMBL4716187)
IC50
0.540000±n/a nM
Citation
 Achary, RYun, JIPark, CMMathi, GRLee, JYHa, JDChae, CHAhn, SPark, CHLee, COHwang, JYYun, CSJung, HJCho, SYKim, HRKim, P Discovery of novel tetrahydroisoquinoline-containing pyrimidines as ALK inhibitors. Bioorg Med Chem 24:207-19 (2016)  
Target
Name:
ALK tyrosine kinase receptor
Synonyms:
ALK ALK_HUMAN CD_antigen: CD246
Type:
Protein
Mol. Mass.:
176453.10
Organism:
Homo sapiens (Human)
Description:
Q9UM73
Residue:
1620
  
Inhibitor
Name:
BDBM243386
Synonyms:
5-chloro-N4-(2-(isopropylsulfonyl)phenyl)-N2-(7-isopropoxy-1,2,3,4-tetrahydroisoquinolin-6-yl)pyrimidine-2,4-diamine | US10053458, 18
Type:
Small organic molecule
Emp. Form.:
C25H30ClN5O3S
Mol. Mass.:
516.055
SMILES:
CC(C)Oc1cc2CNCCc2cc1Nc1ncc(Cl)c(Nc2ccccc2S(=O)(=O)C(C)C)n1
: