Target
ALK tyrosine kinase receptor
Ligand
BDBM243402
Substrate
Meas. Tech.
ChEMBL_2060939 (CHEMBL4716192)
IC50
0.460000±n/a nM
Citation
 Achary, RYun, JIPark, CMMathi, GRLee, JYHa, JDChae, CHAhn, SPark, CHLee, COHwang, JYYun, CSJung, HJCho, SYKim, HRKim, P Discovery of novel tetrahydroisoquinoline-containing pyrimidines as ALK inhibitors. Bioorg Med Chem 24:207-19 (2016)  
Target
Name:
ALK tyrosine kinase receptor
Synonyms:
ALK ALK_HUMAN CD_antigen: CD246
Type:
Protein
Mol. Mass.:
176453.10
Organism:
Homo sapiens (Human)
Description:
Q9UM73
Residue:
1620
  
Inhibitor
Name:
BDBM243402
Synonyms:
5-chloro-N4-(2-(isopropylsulfonyl)phenyl)-N2-(6-methoxy-1,2,3,4-tetrahydroisoquinolin-7-yl)pyrimidine-2,4-diamine | US10053458, 34
Type:
Small organic molecule
Emp. Form.:
C23H26ClN5O3S
Mol. Mass.:
488.002
SMILES:
COc1cc2CCNCc2cc1Nc1ncc(Cl)c(Nc2ccccc2S(=O)(=O)C(C)C)n1
: