Target
Histamine H2 receptor
Ligand
BDBM50119720
Substrate
Meas. Tech.
ChEBML_85525
Ki
380±n/a nM
Citation
 Vasudevan, AConner, SEGentles, RGFaghih, RLiu, HDwight, WIreland, LKang, CHEsbenshade, TABennani, YLHancock, AA Synthesis and evaluation of potent pyrrolidine H(3) antagonists. Bioorg Med Chem Lett 12:3055-8 (2002)  
Target
Name:
Histamine H2 receptor
Synonyms:
Gastric receptor I HISTAMINE H2 HRH2_HUMAN Histamine H2-Gs alpha S
Type:
G Protein-Coupled Receptor (GPCR)
Mol. Mass.:
40115.31
Organism:
Homo sapiens (Human)
Description:
Residue:
359
  
Inhibitor
Name:
BDBM50119720
Synonyms:
CHEMBL107293 | N-{(S)-1-[3-(4-Cyclopropanecarbonyl-phenoxy)-propyl]-pyrrolidin-3-yl}-4-methyl-benzenesulfonamide
Type:
Small organic molecule
Emp. Form.:
C24H30N2O4S
Mol. Mass.:
442.571
SMILES:
Cc1ccc(cc1)S(=O)(=O)N[C@H]1CCN(CCCOc2ccc(cc2)C(=O)C2CC2)C1
: