Target
Vasopressin V2 receptor
Ligand
BDBM50119813
Substrate
Meas. Tech.
ChEMBL_214854 (CHEMBL821469)
Ki
9±n/a nM
Citation
 Dyatkin, ABHoekstra, WJHlasta, DJAndrade-Gordon, Pde Garavilla, LDemarest, KTGunnet, JWHageman, WLook, RMaryanoff, BE Bridged bicyclic vasopressin receptor antagonists with V(2)-selective or dual V(1a)/V(2) activity. Bioorg Med Chem Lett 12:3081-4 (2002)  
Target
Name:
Vasopressin V2 receptor
Synonyms:
ADHR AVPR2 DIR Renal-type arginine vasopressin receptor V2R_HUMAN Vasopressin V2 receptor | Vasopressin receptor
Type:
Receptor
Mol. Mass.:
40295.28
Organism:
Homo sapiens (Human)
Description:
P30518
Residue:
371
  
Inhibitor
Name:
BDBM50119813
Synonyms:
1N-{4-[6-chloro-16-methyl-(12S)-2,10-diazatetracyclo[11.2.1.02,12.04,9]hexadeca-4(9),5,7-trien-10-ylcarbonyl]phenyl}-2-trifluoromethylbenzamide | CHEMBL320416
Type:
Small organic molecule
Emp. Form.:
C29H25ClF3N3O2
Mol. Mass.:
539.976
SMILES:
FC(F)(F)c1ccccc1C(=O)Nc1ccc(cc1)C(=O)N1C[C@@H]2C3CCC(C3)N2Cc2cc(Cl)ccc12
: